Когда я загружаю прошивку ошибка.

Igor836

✩✩✩✩✩✩✩
7 Мар 2019
2
0
In file included from C:\Users\user\Desktop\GyverMatrixOS_v1.11\GyverMatrixOS_v1.11.ino:137:0:

C:\my documents\Arduino\libraries\FastLED-stm32patch/FastLED.h:17:21: note: #pragma message: FastLED version 3.002.000

# pragma message "FastLED version 3.002.000"

^

C:\Users\user\Desktop\GyverMatrixOS_v1.11\effects.ino: In function 'ballRoutine':

C:\Users\user\Desktop\GyverMatrixOS_v1.11\effects.ino:122:1: internal compiler error: Segmentation fault

}

^

Please submit a full bug report,

with preprocessed source if appropriate.

See <http://gcc.gnu.org/bugs.html> for instructions.

lto-wrapper.exe: fatal error: C:\Program Files\WindowsApps\ArduinoLLC.ArduinoIDE_1.8.19.0_x86__mdqgnx93n4wtt\hardware\tools\avr/bin/avr-gcc returned 1 exit status

compilation terminated.

c:/program files/windowsapps/arduinollc.arduinoide_1.8.19.0_x86__mdqgnx93n4wtt/hardware/tools/avr/bin/../lib/gcc/avr/5.4.0/../../../../avr/bin/ld.exe: error: lto-wrapper failed

collect2.exe: error: ld returned 1 exit status

exit status 1
Ошибка компиляции для платы Arduino Nano.
 

Igor836

✩✩✩✩✩✩✩
7 Мар 2019
2
0
Если что скетч алекса гайвера (лента на окно)
Сначала была ошибка недостатка памяти, исправил,
а потом ошибка которая описана